Moodle for mobile

Unable to set up development environment

 
Picture of Jaco-Louis Kruger
Unable to set up development environment
 

Good day

I hope this is the right place for this problem. 

I am trying to set up my development environment for the Moodle mobile app.  I am making use of windows for development and I followed all the steps in https://docs.moodle.org/dev/Setting_up_your_development_environment_for_Moodle_Mobile_2 

I am able to produce a working Ionic serve in my browser, by making use of ionic serve --lab

I am however unable to build an apk with ionic cordova build OR with cordova clean followed by cordova prepare, followed by cordova build android --debug

I have not made any changes to the source, merely made a fork of the repo and cloned it. I have also uninstalled all components needed for the development environment multiple times and tried the setup on several machines with all of them causing the same problems.

I receive the following errors when using cordova build android --debug

cordova build android --debug

cordova-android-support-gradle-release: Android platform: V7.1.2+

cordova-android-support-gradle-release: Wrote custom version '27.1.0' to C:\Users\Jaco-Louis\WebstormProjects\moodlemobilenew3\platforms\android\app\build.gradle

cordova-android-support-gradle-release: Wrote custom version '27.1.0' to C:\Users\Jaco-Louis\WebstormProjects\moodlemobilenew3\platforms\android\app\src\main\cordova-android-support-gradle

-release\properties.gradle

Android Studio project detected

cordova-android-support-gradle-release: Android platform: V7.1.2+

cordova-android-support-gradle-release: Wrote custom version '27.1.0' to C:\Users\Jaco-Louis\WebstormProjects\moodlemobilenew3\platforms\android\app\build.gradle

cordova-android-support-gradle-release: Wrote custom version '27.1.0' to C:\Users\Jaco-Louis\WebstormProjects\moodlemobilenew3\platforms\android\app\src\main\cordova-android-support-gradle

-release\properties.gradle

ANDROID_HOME=C:\Users\Jaco-Louis\AppData\Local\Android\sdk

JAVA_HOME=C:\Program Files\Java\jdk1.8.0_121

studio

Subproject Path: CordovaLib

Subproject Path: app

publishNonDefault is deprecated and has no effect anymore. All variants are now published.

Configuration 'compile' in project ':app' is deprecated. Use 'implementation' instead.

The Task.leftShift(Closure) method has been deprecated and is scheduled to be removed in Gradle 5.0. Please use Task.doLast(Action) instead.

        at build_al7ff5waipfzcofxelldiwtxs.run(C:\Users\Jaco-Louis\WebstormProjects\moodlemobilenew3\platforms\android\app\build.gradle:145)

:CordovaLib:preBuild UP-TO-DATE

:CordovaLib:preDebugBuild UP-TO-DATE

:CordovaLib:compileDebugAidl UP-TO-DATE

:CordovaLib:compileDebugRenderscript UP-TO-DATE

:CordovaLib:checkDebugManifest UP-TO-DATE

:CordovaLib:generateDebugBuildConfig UP-TO-DATE

:CordovaLib:prepareLintJar UP-TO-DATE

:CordovaLib:generateDebugResValues UP-TO-DATE

:CordovaLib:generateDebugResources UP-TO-DATE

:CordovaLib:packageDebugResources UP-TO-DATE

:CordovaLib:platformAttrExtractor UP-TO-DATE

:CordovaLib:processDebugManifest UP-TO-DATE

:CordovaLib:processDebugResources UP-TO-DATE

:CordovaLib:generateDebugSources UP-TO-DATE

:CordovaLib:javaPreCompileDebug UP-TO-DATE

:CordovaLib:compileDebugJavaWithJavac UP-TO-DATE

:CordovaLib:processDebugJavaRes NO-SOURCE

:CordovaLib:transformClassesAndResourcesWithPrepareIntermediateJarsForDebug UP-TO-DATE

:app:preBuild UP-TO-DATE

:app:preDebugBuild UP-TO-DATE

:app:compileDebugAidl UP-TO-DATE

:CordovaLib:packageDebugRenderscript NO-SOURCE

:app:compileDebugRenderscript UP-TO-DATE

:app:checkDebugManifest UP-TO-DATE

:app:generateDebugBuildConfig UP-TO-DATE

:app:prepareLintJar UP-TO-DATE

:app:generateDebugResValues UP-TO-DATE

:app:generateDebugResources UP-TO-DATE

:app:mergeDebugResources UP-TO-DATE

:app:createDebugCompatibleScreenManifests UP-TO-DATE

:app:processDebugManifest UP-TO-DATE

:app:splitsDiscoveryTaskDebug UP-TO-DATE

:app:processDebugResourcesC:\Users\Jaco-Louis\.gradle\caches\transforms-1\files-1.1\support-compat-28.0.0.aar\d43050d5cabf875c26cc5821114cca6a\res\values\values.xml:133:5-70: AAPT: error:

resource android:attr/fontVariationSettings not found.


C:\Users\Jaco-Louis\.gradle\caches\transforms-1\files-1.1\support-compat-28.0.0.aar\d43050d5cabf875c26cc5821114cca6a\res\values\values.xml:133:5-70: AAPT: error: resource android:attr/ttcI

ndex not found.


C:\Users\Jaco-Louis\WebstormProjects\moodlemobilenew3\platforms\android\app\build\intermediates\incremental\mergeDebugResources\merged.dir\values\values.xml:95: error: resource android:att

r/fontVariationSettings not found.

C:\Users\Jaco-Louis\WebstormProjects\moodlemobilenew3\platforms\android\app\build\intermediates\incremental\mergeDebugResources\merged.dir\values\values.xml:95: error: resource android:att

r/ttcIndex not found.

error: failed linking references.


Failed to execute aapt

com.android.ide.common.process.ProcessException: Failed to execute aapt

        at com.android.builder.core.AndroidBuilder.processResources(AndroidBuilder.java:796)

        at com.android.build.gradle.tasks.ProcessAndroidResources.invokeAaptForSplit(ProcessAndroidResources.java:551)

        at com.android.build.gradle.tasks.ProcessAndroidResources.doFullTaskAction(ProcessAndroidResources.java:285)

        at com.android.build.gradle.internal.tasks.IncrementalTask.taskAction(IncrementalTask.java:109)

        at sun.reflect.NativeMethodAccessorImpl.invoke0(Native Method)

        at sun.reflect.NativeMethodAccessorImpl.invoke(NativeMethodAccessorImpl.java:62)

        at sun.reflect.DelegatingMethodAccessorImpl.invoke(DelegatingMethodAccessorImpl.java:43)

        at java.lang.reflect.Method.invoke(Method.java:498)

        at org.gradle.internal.reflect.JavaMethod.invoke(JavaMethod.java:73)

        at org.gradle.api.internal.project.taskfactory.DefaultTaskClassInfoStore$IncrementalTaskAction.doExecute(DefaultTaskClassInfoStore.java:173)

        at org.gradle.api.internal.project.taskfactory.DefaultTaskClassInfoStore$StandardTaskAction.execute(DefaultTaskClassInfoStore.java:134)

        at org.gradle.api.internal.project.taskfactory.DefaultTaskClassInfoStore$StandardTaskAction.execute(DefaultTaskClassInfoStore.java:121)

        at org.gradle.api.internal.tasks.execution.ExecuteActionsTaskExecuter$1.run(ExecuteActionsTaskExecuter.java:122)

        at org.gradle.internal.progress.DefaultBuildOperationExecutor$RunnableBuildOperationWorker.execute(DefaultBuildOperationExecutor.java:336)

        at org.gradle.internal.progress.DefaultBuildOperationExecutor$RunnableBuildOperationWorker.execute(DefaultBuildOperationExecutor.java:328)

        at org.gradle.internal.progress.DefaultBuildOperationExecutor.execute(DefaultBuildOperationExecutor.java:197)

        at org.gradle.internal.progress.DefaultBuildOperationExecutor.run(DefaultBuildOperationExecutor.java:107)

        at org.gradle.api.internal.tasks.execution.ExecuteActionsTaskExecuter.executeAction(ExecuteActionsTaskExecuter.java:111)

        at org.gradle.api.internal.tasks.execution.ExecuteActionsTaskExecuter.executeActions(ExecuteActionsTaskExecuter.java:92)

        at org.gradle.api.internal.tasks.execution.ExecuteActionsTaskExecuter.execute(ExecuteActionsTaskExecuter.java:70)

        at org.gradle.api.internal.tasks.execution.SkipUpToDateTaskExecuter.execute(SkipUpToDateTaskExecuter.java:63)

        at org.gradle.api.internal.tasks.execution.ResolveTaskOutputCachingStateExecuter.execute(ResolveTaskOutputCachingStateExecuter.java:54)

        at org.gradle.api.internal.tasks.execution.ValidatingTaskExecuter.execute(ValidatingTaskExecuter.java:58)

        at org.gradle.api.internal.tasks.execution.SkipEmptySourceFilesTaskExecuter.execute(SkipEmptySourceFilesTaskExecuter.java:88)

        at org.gradle.api.internal.tasks.execution.ResolveTaskArtifactStateTaskExecuter.execute(ResolveTaskArtifactStateTaskExecuter.java:52)

        at org.gradle.api.internal.tasks.execution.SkipTaskWithNoActionsExecuter.execute(SkipTaskWithNoActionsExecuter.java:52)

        at org.gradle.api.internal.tasks.execution.SkipOnlyIfTaskExecuter.execute(SkipOnlyIfTaskExecuter.java:54)

        at org.gradle.api.internal.tasks.execution.ExecuteAtMostOnceTaskExecuter.execute(ExecuteAtMostOnceTaskExecuter.java:43)

        at org.gradle.api.internal.tasks.execution.CatchExceptionTaskExecuter.execute(CatchExceptionTaskExecuter.java:34)

        at org.gradle.execution.taskgraph.DefaultTaskGraphExecuter$EventFiringTaskWorker$1.run(DefaultTaskGraphExecuter.java:248)

        at org.gradle.internal.progress.DefaultBuildOperationExecutor$RunnableBuildOperationWorker.execute(DefaultBuildOperationExecutor.java:336)

        at org.gradle.internal.progress.DefaultBuildOperationExecutor$RunnableBuildOperationWorker.execute(DefaultBuildOperationExecutor.java:328)

        at org.gradle.internal.progress.DefaultBuildOperationExecutor.execute(DefaultBuildOperationExecutor.java:197)

        at org.gradle.internal.progress.DefaultBuildOperationExecutor.run(DefaultBuildOperationExecutor.java:107)

        at org.gradle.execution.taskgraph.DefaultTaskGraphExecuter$EventFiringTaskWorker.execute(DefaultTaskGraphExecuter.java:241)

        at org.gradle.execution.taskgraph.DefaultTaskGraphExecuter$EventFiringTaskWorker.execute(DefaultTaskGraphExecuter.java:230)

        at org.gradle.execution.taskgraph.DefaultTaskPlanExecutor$TaskExecutorWorker.processTask(DefaultTaskPlanExecutor.java:124)

        at org.gradle.execution.taskgraph.DefaultTaskPlanExecutor$TaskExecutorWorker.access$200(DefaultTaskPlanExecutor.java:80)

        at org.gradle.execution.taskgraph.DefaultTaskPlanExecutor$TaskExecutorWorker$1.execute(DefaultTaskPlanExecutor.java:105)

        at org.gradle.execution.taskgraph.DefaultTaskPlanExecutor$TaskExecutorWorker$1.execute(DefaultTaskPlanExecutor.java:99)

        at org.gradle.execution.taskgraph.DefaultTaskExecutionPlan.execute(DefaultTaskExecutionPlan.java:625)

        at org.gradle.execution.taskgraph.DefaultTaskExecutionPlan.executeWithTask(DefaultTaskExecutionPlan.java:580)

        at org.gradle.execution.taskgraph.DefaultTaskPlanExecutor$TaskExecutorWorker.run(DefaultTaskPlanExecutor.java:99)

        at org.gradle.internal.concurrent.ExecutorPolicy$CatchAndRecordFailures.onExecute(ExecutorPolicy.java:63)

        at org.gradle.internal.concurrent.ManagedExecutorImpl$1.run(ManagedExecutorImpl.java:46)

        at java.util.concurrent.ThreadPoolExecutor.runWorker(ThreadPoolExecutor.java:1142)

        at java.util.concurrent.ThreadPoolExecutor$Worker.run(ThreadPoolExecutor.java:617)

        at org.gradle.internal.concurrent.ThreadFactoryImpl$ManagedThreadRunnable.run(ThreadFactoryImpl.java:55)

        at java.lang.Thread.run(Thread.java:745)

Caused by: java.util.concurrent.ExecutionException: java.util.concurrent.ExecutionException: com.android.tools.aapt2.Aapt2Exception: AAPT2 error: check logs for details

        at com.google.common.util.concurrent.AbstractFuture.getDoneValue(AbstractFuture.java:503)

        at com.google.common.util.concurrent.AbstractFuture.get(AbstractFuture.java:482)

        at com.google.common.util.concurrent.AbstractFuture$TrustedFuture.get(AbstractFuture.java:79)

        at com.android.builder.core.AndroidBuilder.processResources(AndroidBuilder.java:794)

        ... 48 more

Caused by: java.util.concurrent.ExecutionException: com.android.tools.aapt2.Aapt2Exception: AAPT2 error: check logs for details

        at com.google.common.util.concurrent.AbstractFuture.getDoneValue(AbstractFuture.java:503)

        at com.google.common.util.concurrent.AbstractFuture.get(AbstractFuture.java:462)

        at com.google.common.util.concurrent.AbstractFuture$TrustedFuture.get(AbstractFuture.java:79)

        at com.android.builder.internal.aapt.v2.QueueableAapt2.lambda$makeValidatedPackage$1(QueueableAapt2.java:179)

        at java.util.concurrent.ThreadPoolExecutor.runWorker(ThreadPoolExecutor.java:1142)

        at java.util.concurrent.ThreadPoolExecutor$Worker.run(ThreadPoolExecutor.java:617)

        ... 1 more

Caused by: com.android.tools.aapt2.Aapt2Exception: AAPT2 error: check logs for details

        at com.android.builder.png.AaptProcess$NotifierProcessOutput.handleOutput(AaptProcess.java:463)

        at com.android.builder.png.AaptProcess$NotifierProcessOutput.err(AaptProcess.java:415)

        at com.android.builder.png.AaptProcess$ProcessOutputFacade.err(AaptProcess.java:332)

        at com.android.utils.GrabProcessOutput$1.run(GrabProcessOutput.java:104)

 FAILED

25 actionable tasks: 1 executed, 24 up-to-date


FAILURE: Build failed with an exception.


* What went wrong:

Execution failed for task ':app:processDebugResources'.

> Failed to execute aapt


* Try:

Run with --stacktrace option to get the stack trace. Run with --info or --debug option to get more log output.


* Get more help at https://help.gradle.org


BUILD FAILED in 4s

cmd: Command failed with exit code 1 Error output:

C:\Users\Jaco-Louis\.gradle\caches\transforms-1\files-1.1\support-compat-28.0.0.aar\d43050d5cabf875c26cc5821114cca6a\res\values\values.xml:133:5-70: AAPT: error: resource android:attr/font

VariationSettings not found.


C:\Users\Jaco-Louis\.gradle\caches\transforms-1\files-1.1\support-compat-28.0.0.aar\d43050d5cabf875c26cc5821114cca6a\res\values\values.xml:133:5-70: AAPT: error: resource android:attr/ttcI

ndex not found.


C:\Users\Jaco-Louis\WebstormProjects\moodlemobilenew3\platforms\android\app\build\intermediates\incremental\mergeDebugResources\merged.dir\values\values.xml:95: error: resource android:att

r/fontVariationSettings not found.

C:\Users\Jaco-Louis\WebstormProjects\moodlemobilenew3\platforms\android\app\build\intermediates\incremental\mergeDebugResources\merged.dir\values\values.xml:95: error: resource android:att

r/ttcIndex not found.

error: failed linking references.


Failed to execute aapt

com.android.ide.common.process.ProcessException: Failed to execute aapt

        at com.android.builder.core.AndroidBuilder.processResources(AndroidBuilder.java:796)

        at com.android.build.gradle.tasks.ProcessAndroidResources.invokeAaptForSplit(ProcessAndroidResources.java:551)

        at com.android.build.gradle.tasks.ProcessAndroidResources.doFullTaskAction(ProcessAndroidResources.java:285)

        at com.android.build.gradle.internal.tasks.IncrementalTask.taskAction(IncrementalTask.java:109)

        at sun.reflect.NativeMethodAccessorImpl.invoke0(Native Method)

        at sun.reflect.NativeMethodAccessorImpl.invoke(NativeMethodAccessorImpl.java:62)

        at sun.reflect.DelegatingMethodAccessorImpl.invoke(DelegatingMethodAccessorImpl.java:43)

        at java.lang.reflect.Method.invoke(Method.java:498)

        at org.gradle.internal.reflect.JavaMethod.invoke(JavaMethod.java:73)

        at org.gradle.api.internal.project.taskfactory.DefaultTaskClassInfoStore$IncrementalTaskAction.doExecute(DefaultTaskClassInfoStore.java:173)

        at org.gradle.api.internal.project.taskfactory.DefaultTaskClassInfoStore$StandardTaskAction.execute(DefaultTaskClassInfoStore.java:134)

        at org.gradle.api.internal.project.taskfactory.DefaultTaskClassInfoStore$StandardTaskAction.execute(DefaultTaskClassInfoStore.java:121)

        at org.gradle.api.internal.tasks.execution.ExecuteActionsTaskExecuter$1.run(ExecuteActionsTaskExecuter.java:122)

        at org.gradle.internal.progress.DefaultBuildOperationExecutor$RunnableBuildOperationWorker.execute(DefaultBuildOperationExecutor.java:336)

        at org.gradle.internal.progress.DefaultBuildOperationExecutor$RunnableBuildOperationWorker.execute(DefaultBuildOperationExecutor.java:328)

        at org.gradle.internal.progress.DefaultBuildOperationExecutor.execute(DefaultBuildOperationExecutor.java:197)

        at org.gradle.internal.progress.DefaultBuildOperationExecutor.run(DefaultBuildOperationExecutor.java:107)

        at org.gradle.api.internal.tasks.execution.ExecuteActionsTaskExecuter.executeAction(ExecuteActionsTaskExecuter.java:111)

        at org.gradle.api.internal.tasks.execution.ExecuteActionsTaskExecuter.executeActions(ExecuteActionsTaskExecuter.java:92)

        at org.gradle.api.internal.tasks.execution.ExecuteActionsTaskExecuter.execute(ExecuteActionsTaskExecuter.java:70)

        at org.gradle.api.internal.tasks.execution.SkipUpToDateTaskExecuter.execute(SkipUpToDateTaskExecuter.java:63)

        at org.gradle.api.internal.tasks.execution.ResolveTaskOutputCachingStateExecuter.execute(ResolveTaskOutputCachingStateExecuter.java:54)

        at org.gradle.api.internal.tasks.execution.ValidatingTaskExecuter.execute(ValidatingTaskExecuter.java:58)

        at org.gradle.api.internal.tasks.execution.SkipEmptySourceFilesTaskExecuter.execute(SkipEmptySourceFilesTaskExecuter.java:88)

        at org.gradle.api.internal.tasks.execution.ResolveTaskArtifactStateTaskExecuter.execute(ResolveTaskArtifactStateTaskExecuter.java:52)

        at org.gradle.api.internal.tasks.execution.SkipTaskWithNoActionsExecuter.execute(SkipTaskWithNoActionsExecuter.java:52)

        at org.gradle.api.internal.tasks.execution.SkipOnlyIfTaskExecuter.execute(SkipOnlyIfTaskExecuter.java:54)

        at org.gradle.api.internal.tasks.execution.ExecuteAtMostOnceTaskExecuter.execute(ExecuteAtMostOnceTaskExecuter.java:43)

        at org.gradle.api.internal.tasks.execution.CatchExceptionTaskExecuter.execute(CatchExceptionTaskExecuter.java:34)

        at org.gradle.execution.taskgraph.DefaultTaskGraphExecuter$EventFiringTaskWorker$1.run(DefaultTaskGraphExecuter.java:248)

        at org.gradle.internal.progress.DefaultBuildOperationExecutor$RunnableBuildOperationWorker.execute(DefaultBuildOperationExecutor.java:336)

        at org.gradle.internal.progress.DefaultBuildOperationExecutor$RunnableBuildOperationWorker.execute(DefaultBuildOperationExecutor.java:328)

        at org.gradle.internal.progress.DefaultBuildOperationExecutor.execute(DefaultBuildOperationExecutor.java:197)

        at org.gradle.internal.progress.DefaultBuildOperationExecutor.run(DefaultBuildOperationExecutor.java:107)

        at org.gradle.execution.taskgraph.DefaultTaskGraphExecuter$EventFiringTaskWorker.execute(DefaultTaskGraphExecuter.java:241)

        at org.gradle.execution.taskgraph.DefaultTaskGraphExecuter$EventFiringTaskWorker.execute(DefaultTaskGraphExecuter.java:230)

        at org.gradle.execution.taskgraph.DefaultTaskPlanExecutor$TaskExecutorWorker.processTask(DefaultTaskPlanExecutor.java:124)

        at org.gradle.execution.taskgraph.DefaultTaskPlanExecutor$TaskExecutorWorker.access$200(DefaultTaskPlanExecutor.java:80)

        at org.gradle.execution.taskgraph.DefaultTaskPlanExecutor$TaskExecutorWorker$1.execute(DefaultTaskPlanExecutor.java:105)

        at org.gradle.execution.taskgraph.DefaultTaskPlanExecutor$TaskExecutorWorker$1.execute(DefaultTaskPlanExecutor.java:99)

        at org.gradle.execution.taskgraph.DefaultTaskExecutionPlan.execute(DefaultTaskExecutionPlan.java:625)

        at org.gradle.execution.taskgraph.DefaultTaskExecutionPlan.executeWithTask(DefaultTaskExecutionPlan.java:580)

        at org.gradle.execution.taskgraph.DefaultTaskPlanExecutor$TaskExecutorWorker.run(DefaultTaskPlanExecutor.java:99)

        at org.gradle.internal.concurrent.ExecutorPolicy$CatchAndRecordFailures.onExecute(ExecutorPolicy.java:63)

        at org.gradle.internal.concurrent.ManagedExecutorImpl$1.run(ManagedExecutorImpl.java:46)

        at java.util.concurrent.ThreadPoolExecutor.runWorker(ThreadPoolExecutor.java:1142)

        at java.util.concurrent.ThreadPoolExecutor$Worker.run(ThreadPoolExecutor.java:617)

        at org.gradle.internal.concurrent.ThreadFactoryImpl$ManagedThreadRunnable.run(ThreadFactoryImpl.java:55)

        at java.lang.Thread.run(Thread.java:745)

Caused by: java.util.concurrent.ExecutionException: java.util.concurrent.ExecutionException: com.android.tools.aapt2.Aapt2Exception: AAPT2 error: check logs for details

        at com.google.common.util.concurrent.AbstractFuture.getDoneValue(AbstractFuture.java:503)

        at com.google.common.util.concurrent.AbstractFuture.get(AbstractFuture.java:482)

        at com.google.common.util.concurrent.AbstractFuture$TrustedFuture.get(AbstractFuture.java:79)

        at com.android.builder.core.AndroidBuilder.processResources(AndroidBuilder.java:794)

        ... 48 more

Caused by: java.util.concurrent.ExecutionException: com.android.tools.aapt2.Aapt2Exception: AAPT2 error: check logs for details

        at com.google.common.util.concurrent.AbstractFuture.getDoneValue(AbstractFuture.java:503)

        at com.google.common.util.concurrent.AbstractFuture.get(AbstractFuture.java:462)

        at com.google.common.util.concurrent.AbstractFuture$TrustedFuture.get(AbstractFuture.java:79)

        at com.android.builder.internal.aapt.v2.QueueableAapt2.lambda$makeValidatedPackage$1(QueueableAapt2.java:179)

        at java.util.concurrent.ThreadPoolExecutor.runWorker(ThreadPoolExecutor.java:1142)

        at java.util.concurrent.ThreadPoolExecutor$Worker.run(ThreadPoolExecutor.java:617)

        ... 1 more

Caused by: com.android.tools.aapt2.Aapt2Exception: AAPT2 error: check logs for details

        at com.android.builder.png.AaptProcess$NotifierProcessOutput.handleOutput(AaptProcess.java:463)

        at com.android.builder.png.AaptProcess$NotifierProcessOutput.err(AaptProcess.java:415)

        at com.android.builder.png.AaptProcess$ProcessOutputFacade.err(AaptProcess.java:332)

        at com.android.utils.GrabProcessOutput$1.run(GrabProcessOutput.java:104)


FAILURE: Build failed with an exception.


* What went wrong:

Execution failed for task ':app:processDebugResources'.

> Failed to execute aapt


* Try:

Run with --stacktrace option to get the stack trace. Run with --info or --debug option to get more log output.


* Get more help at https://help.gradle.org


BUILD FAILED in 4s


Here is the output received when using ionic build:

ionic build

> npm run ionic:build:before


> moodlemobile@3.5.1 ionic:build:before C:\Users\Jaco-Louis\WebstormProjects\moodlemobilenew3

> gulp


[13:31:12] Using gulpfile ~\WebstormProjects\moodlemobilenew3\gulpfile.js

[13:31:12] Starting 'lang'...

[13:31:13] Starting 'config'...

(node:10616) [DEP0005] DeprecationWarning: Buffer() is deprecated due to security and usability issues. Please use the Buffer.alloc(), Buffer.allocUnsafe(), or Buffer.from() methods instea

d.

[13:31:21] Finished 'config' after 8.31 s

[13:31:22] Finished 'lang' after 9.4 s

[13:31:22] Starting 'default'...

[13:31:22] Finished 'default' after 34 μs

> npm run ionic:build


> moodlemobile@3.5.1 preionic:build C:\Users\Jaco-Louis\WebstormProjects\moodlemobilenew3

> gulp


[13:31:24] Using gulpfile ~\WebstormProjects\moodlemobilenew3\gulpfile.js

[13:31:24] Starting 'lang'...

[13:31:24] Starting 'config'...

(node:11632) [DEP0005] DeprecationWarning: Buffer() is deprecated due to security and usability issues. Please use the Buffer.alloc(), Buffer.allocUnsafe(), or Buffer.from() methods instea

d.

[13:31:32] Finished 'config' after 8.12 s

[13:31:33] Finished 'lang' after 9 s

[13:31:33] Starting 'default'...

[13:31:33] Finished 'default' after 35 μs


> moodlemobile@3.5.1 ionic:build C:\Users\Jaco-Louis\WebstormProjects\moodlemobilenew3

> node --max-old-space-size=16384 ./node_modules/@ionic/app-scripts/bin/ionic-app-scripts.js build


[13:31:37]  ionic-app-scripts 3.2.0 

[13:31:37]  build dev started ...

[13:31:37]  clean started ...

[13:31:37]  clean finished in 217 ms

[13:31:37]  copy started ...

[13:31:38]  copy finished in 1.02 s

[13:31:38]  deeplinks started ...

[13:31:41]  deeplinks finished in 2.35 s

[13:31:41]  transpile started ...

[13:32:03]  transpile finished in 22.41 s

[13:32:03]  preprocess started ...

[13:32:03]  preprocess finished in 1 ms

[13:32:03]  webpack started ...

[13:32:31]  ionic-app-script task: "build" 

[13:32:31]  Error: ./node_modules/electron-windows-notifications/src/toast-notification.js Module not found: Error: 

            Can't resolve '@nodert-win10-au/windows.data.xml.dom' in 

            'C:\Users\Jaco-Louis\WebstormProjects\moodlemobilenew3\node_modules\electron-windows-notifications\src' 

            resolve '@nodert-win10-au/windows.data.xml.dom' in 

            'C:\Users\Jaco-Louis\WebstormProjects\moodlemobilenew3\node_modules\electron-windows-notifications\src' 

            Parsed request is a module using description file: 

            C:\Users\Jaco-Louis\WebstormProjects\moodlemobilenew3\node_modules\electron-windows-notifications\package.json

            (relative path: ./src) Field 'browser' doesn't contain a valid alias configuration after using description 

            file: 

            C:\Users\Jaco-Louis\WebstormProjects\moodlemobilenew3\node_modules\electron-windows-notifications\package.json

            (relative path: ./src) resolve as module looking for modules in 

            C:\Users\Jaco-Louis\WebstormProjects\moodlemobilenew3\node_modules using description file: 

            C:\Users\Jaco-Louis\WebstormProjects\moodlemobilenew3\package.json (relative path: ./node_modules) after 

            using description file: C:\Users\Jaco-Louis\WebstormProjects\moodlemobilenew3\package.json (relative path: 

            ./node_modules) using description file: C:\Users\Jaco-Louis\WebstormProjects\moodlemobilenew3\package.json 

            (relative path: ./node_modules/@nodert-win10-au/windows.data.xml.dom) no extension 

            C:\Users\Jaco-Louis\WebstormProjects\moodlemobilenew3\node_modules\@nodert-win10-au\windows.data.xml.dom 

            doesn't exist .ts 

            C:\Users\Jaco-Louis\WebstormProjects\moodlemobilenew3\node_modules\@nodert-win10-au\windows.data.xml.dom.ts 

            doesn't exist .js 

            C:\Users\Jaco-Louis\WebstormProjects\moodlemobilenew3\node_modules\@nodert-win10-au\windows.data.xml.dom.js 

            doesn't exist .json 

            C:\Users\Jaco-Louis\WebstormProjects\moodlemobilenew3\node_modules\@nodert-win10-au\windows.data.xml.dom.json

            doesn't exist as directory 

            C:\Users\Jaco-Louis\WebstormProjects\moodlemobilenew3\node_modules\@nodert-win10-au\windows.data.xml.dom 

            doesn't exist 

            [C:\Users\Jaco-Louis\WebstormProjects\moodlemobilenew3\node_modules\@nodert-win10-au\windows.data.xml.dom] 

            [C:\Users\Jaco-Louis\WebstormProjects\moodlemobilenew3\node_modules\@nodert-win10-au\windows.data.xml.dom.ts]

            [C:\Users\Jaco-Louis\WebstormProjects\moodlemobilenew3\node_modules\@nodert-win10-au\windows.data.xml.dom.js]

            [C:\Users\Jaco-Louis\WebstormProjects\moodlemobilenew3\node_modules\@nodert-win10-au\windows.data.xml.dom.json]

            [C:\Users\Jaco-Louis\WebstormProjects\moodlemobilenew3\node_modules\@nodert-win10-au\windows.data.xml.dom] @ 

            ./node_modules/electron-windows-notifications/src/toast-notification.js 1:12-60 @ 

            ./node_modules/electron-windows-notifications/src/index.js @ 

            ./src/core/emulator/providers/local-notifications.ts @ ./src/core/emulator/emulator.module.ts @ 

            ./src/app/app.module.ts @ 

            ./src/app/main.ts,./node_modules/electron-windows-notifications/src/tile-notification.js Module not found: 

            Error: Can't resolve '@nodert-win10-au/windows.data.xml.dom' in 

            'C:\Users\Jaco-Louis\WebstormProjects\moodlemobilenew3\node_modules\electron-windows-notifications\src' 

            resolve '@nodert-win10-au/windows.data.xml.dom' in 

            'C:\Users\Jaco-Louis\WebstormProjects\moodlemobilenew3\node_modules\electron-windows-notifications\src' 

            Parsed request is a module using description file: 

            C:\Users\Jaco-Louis\WebstormProjects\moodlemobilenew3\node_modules\electron-windows-notifications\package.json

            (relative path: ./src) Field 'browser' doesn't contain a valid alias configuration after using description 

            file: 

            C:\Users\Jaco-Louis\WebstormProjects\moodlemobilenew3\node_modules\electron-windows-notifications\package.json

            (relative path: ./src) resolve as module looking for modules in 

            C:\Users\Jaco-Louis\WebstormProjects\moodlemobilenew3\node_modules using description file: 

            C:\Users\Jaco-Louis\WebstormProjects\moodlemobilenew3\package.json (relative path: ./node_modules) after 

            using description file: C:\Users\Jaco-Louis\WebstormProjects\moodlemobilenew3\package.json (relative path: 

            ./node_modules) using description file: C:\Users\Jaco-Louis\WebstormProjects\moodlemobilenew3\package.json 

            (relative path: ./node_modules/@nodert-win10-au/windows.data.xml.dom) no extension 

            C:\Users\Jaco-Louis\WebstormProjects\moodlemobilenew3\node_modules\@nodert-win10-au\windows.data.xml.dom 

            doesn't exist .ts 

            C:\Users\Jaco-Louis\WebstormProjects\moodlemobilenew3\node_modules\@nodert-win10-au\windows.data.xml.dom.ts 

            doesn't exist .js 

            C:\Users\Jaco-Louis\WebstormProjects\moodlemobilenew3\node_modules\@nodert-win10-au\windows.data.xml.dom.js 

            doesn't exist .json 

            C:\Users\Jaco-Louis\WebstormProjects\moodlemobilenew3\node_modules\@nodert-win10-au\windows.data.xml.dom.json

            doesn't exist as directory 

            C:\Users\Jaco-Louis\WebstormProjects\moodlemobilenew3\node_modules\@nodert-win10-au\windows.data.xml.dom 

            doesn't exist 

            [C:\Users\Jaco-Louis\WebstormProjects\moodlemobilenew3\node_modules\@nodert-win10-au\windows.data.xml.dom] 

            [C:\Users\Jaco-Louis\WebstormProjects\moodlemobilenew3\node_modules\@nodert-win10-au\windows.data.xml.dom.ts]

            [C:\Users\Jaco-Louis\WebstormProjects\moodlemobilenew3\node_modules\@nodert-win10-au\windows.data.xml.dom.js]

            [C:\Users\Jaco-Louis\WebstormProjects\moodlemobilenew3\node_modules\@nodert-win10-au\windows.data.xml.dom.json]

            [C:\Users\Jaco-Louis\WebstormProjects\moodlemobilenew3\node_modules\@nodert-win10-au\windows.data.xml.dom] @ 

            ./node_modules/electron-windows-notifications/src/tile-notification.js 1:12-60 @ 

            ./node_modules/electron-windows-notifications/src/index.js @ 

            ./src/core/emulator/providers/local-notifications.ts @ ./src/core/emulator/emulator.module.ts @ 

            ./src/app/app.module.ts @ 

            ./src/app/main.ts,./node_modules/electron-windows-notifications/src/secondary-tile.js Module not found: 

            Error: Can't resolve '@nodert-win10-au/windows.foundation' in 

            'C:\Users\Jaco-Louis\WebstormProjects\moodlemobilenew3\node_modules\electron-windows-notifications\src' 

            resolve '@nodert-win10-au/windows.foundation' in 

            'C:\Users\Jaco-Louis\WebstormProjects\moodlemobilenew3\node_modules\electron-windows-notifications\src' 

            Parsed request is a module using description file: 

            C:\Users\Jaco-Louis\WebstormProjects\moodlemobilenew3\node_modules\electron-windows-notifications\package.json

            (relative path: ./src) Field 'browser' doesn't contain a valid alias configuration after using description 

            file: 

            C:\Users\Jaco-Louis\WebstormProjects\moodlemobilenew3\node_modules\electron-windows-notifications\package.json

            (relative path: ./src) resolve as module looking for modules in 

            C:\Users\Jaco-Louis\WebstormProjects\moodlemobilenew3\node_modules using description file: 

            C:\Users\Jaco-Louis\WebstormProjects\moodlemobilenew3\package.json (relative path: ./node_modules) after 

            using description file: C:\Users\Jaco-Louis\WebstormProjects\moodlemobilenew3\package.json (relative path: 

            ./node_modules) using description file: C:\Users\Jaco-Louis\WebstormProjects\moodlemobilenew3\package.json 

            (relative path: ./node_modules/@nodert-win10-au/windows.foundation) no extension 

            C:\Users\Jaco-Louis\WebstormProjects\moodlemobilenew3\node_modules\@nodert-win10-au\windows.foundation 

            doesn't exist .ts 

            C:\Users\Jaco-Louis\WebstormProjects\moodlemobilenew3\node_modules\@nodert-win10-au\windows.foundation.ts 

            doesn't exist .js 

            C:\Users\Jaco-Louis\WebstormProjects\moodlemobilenew3\node_modules\@nodert-win10-au\windows.foundation.js 

            doesn't exist .json 

            C:\Users\Jaco-Louis\WebstormProjects\moodlemobilenew3\node_modules\@nodert-win10-au\windows.foundation.json 

            doesn't exist as directory 

            C:\Users\Jaco-Louis\WebstormProjects\moodlemobilenew3\node_modules\@nodert-win10-au\windows.foundation 

            doesn't exist 

            [C:\Users\Jaco-Louis\WebstormProjects\moodlemobilenew3\node_modules\@nodert-win10-au\windows.foundation] 

            [C:\Users\Jaco-Louis\WebstormProjects\moodlemobilenew3\node_modules\@nodert-win10-au\windows.foundation.ts] 

            [C:\Users\Jaco-Louis\WebstormProjects\moodlemobilenew3\node_modules\@nodert-win10-au\windows.foundation.js] 

            [C:\Users\Jaco-Louis\WebstormProjects\moodlemobilenew3\node_modules\@nodert-win10-au\windows.foundation.json]

            [C:\Users\Jaco-Louis\WebstormProjects\moodlemobilenew3\node_modules\@nodert-win10-au\windows.foundation] @ 

            ./node_modules/electron-windows-notifications/src/secondary-tile.js 34:31-77 @ 

            ./node_modules/electron-windows-notifications/src/index.js @ 

            ./src/core/emulator/providers/local-notifications.ts @ ./src/core/emulator/emulator.module.ts @ 

            ./src/app/app.module.ts @ ./src/app/main.ts,./node_modules/electron-windows-notifications/src/index.js 

            Module not found: Error: Can't resolve '@nodert-win10-au/windows.ui.notifications' in 

            'C:\Users\Jaco-Louis\WebstormProjects\moodlemobilenew3\node_modules\electron-windows-notifications\src' 

            resolve '@nodert-win10-au/windows.ui.notifications' in 

            'C:\Users\Jaco-Louis\WebstormProjects\moodlemobilenew3\node_modules\electron-windows-notifications\src' 

            Parsed request is a module using description file: 

            C:\Users\Jaco-Louis\WebstormProjects\moodlemobilenew3\node_modules\electron-windows-notifications\package.json

            (relative path: ./src) Field 'browser' doesn't contain a valid alias configuration after using description 

            file: 

            C:\Users\Jaco-Louis\WebstormProjects\moodlemobilenew3\node_modules\electron-windows-notifications\package.json

            (relative path: ./src) resolve as module looking for modules in 

            C:\Users\Jaco-Louis\WebstormProjects\moodlemobilenew3\node_modules using description file: 

            C:\Users\Jaco-Louis\WebstormProjects\moodlemobilenew3\package.json (relative path: ./node_modules) after 

            using description file: C:\Users\Jaco-Louis\WebstormProjects\moodlemobilenew3\package.json (relative path: 

            ./node_modules) using description file: C:\Users\Jaco-Louis\WebstormProjects\moodlemobilenew3\package.json 

            (relative path: ./node_modules/@nodert-win10-au/windows.ui.notifications) no extension 

            C:\Users\Jaco-Louis\WebstormProjects\moodlemobilenew3\node_modules\@nodert-win10-au\windows.ui.notifications 

            doesn't exist .ts 

            C:\Users\Jaco-Louis\WebstormProjects\moodlemobilenew3\node_modules\@nodert-win10-au\windows.ui.notifications.ts

            doesn't exist .js 

            C:\Users\Jaco-Louis\WebstormProjects\moodlemobilenew3\node_modules\@nodert-win10-au\windows.ui.notifications.js

            doesn't exist .json 

            C:\Users\Jaco-Louis\WebstormProjects\moodlemobilenew3\node_modules\@nodert-win10-au\windows.ui.notifications.json

            doesn't exist as directory 

            C:\Users\Jaco-Louis\WebstormProjects\moodlemobilenew3\node_modules\@nodert-win10-au\windows.ui.notifications 

            doesn't exist 

            [C:\Users\Jaco-Louis\WebstormProjects\moodlemobilenew3\node_modules\@nodert-win10-au\windows.ui.notifications]

            [C:\Users\Jaco-Louis\WebstormProjects\moodlemobilenew3\node_modules\@nodert-win10-au\windows.ui.notifications.ts]

            [C:\Users\Jaco-Louis\WebstormProjects\moodlemobilenew3\node_modules\@nodert-win10-au\windows.ui.notifications.js]

            [C:\Users\Jaco-Louis\WebstormProjects\moodlemobilenew3\node_modules\@nodert-win10-au\windows.ui.notifications.json]

            [C:\Users\Jaco-Louis\WebstormProjects\moodlemobilenew3\node_modules\@nodert-win10-au\windows.ui.notifications]

            @ ./node_modules/electron-windows-notifications/src/index.js 33:26-78 @ 

            ./src/core/emulator/providers/local-notifications.ts @ ./src/core/emulator/emulator.module.ts @ 

            ./src/app/app.module.ts @ 

            ./src/app/main.ts,./node_modules/electron-windows-notifications/src/toast-notification.js Module not found: 

            Error: Can't resolve '@nodert-win10-au/windows.ui.notifications' in 

            'C:\Users\Jaco-Louis\WebstormProjects\moodlemobilenew3\node_modules\electron-windows-notifications\src' 

            resolve '@nodert-win10-au/windows.ui.notifications' in 

            'C:\Users\Jaco-Louis\WebstormProjects\moodlemobilenew3\node_modules\electron-windows-notifications\src' 

            Parsed request is a module using description file: 

            C:\Users\Jaco-Louis\WebstormProjects\moodlemobilenew3\node_modules\electron-windows-notifications\package.json

            (relative path: ./src) Field 'browser' doesn't contain a valid alias configuration after using description 

            file: 

            C:\Users\Jaco-Louis\WebstormProjects\moodlemobilenew3\node_modules\electron-windows-notifications\package.json

            (relative path: ./src) resolve as module looking for modules in 

            C:\Users\Jaco-Louis\WebstormProjects\moodlemobilenew3\node_modules using description file: 

            C:\Users\Jaco-Louis\WebstormProjects\moodlemobilenew3\package.json (relative path: ./node_modules) after 

            using description file: C:\Users\Jaco-Louis\WebstormProjects\moodlemobilenew3\package.json (relative path: 

            ./node_modules) using description file: C:\Users\Jaco-Louis\WebstormProjects\moodlemobilenew3\package.json 

            (relative path: ./node_modules/@nodert-win10-au/windows.ui.notifications) no extension 

            C:\Users\Jaco-Louis\WebstormProjects\moodlemobilenew3\node_modules\@nodert-win10-au\windows.ui.notifications 

            doesn't exist .ts 

            C:\Users\Jaco-Louis\WebstormProjects\moodlemobilenew3\node_modules\@nodert-win10-au\windows.ui.notifications.ts

            doesn't exist .js 

            C:\Users\Jaco-Louis\WebstormProjects\moodlemobilenew3\node_modules\@nodert-win10-au\windows.ui.notifications.js

            doesn't exist .json 

            C:\Users\Jaco-Louis\WebstormProjects\moodlemobilenew3\node_modules\@nodert-win10-au\windows.ui.notifications.json

            doesn't exist as directory 

            C:\Users\Jaco-Louis\WebstormProjects\moodlemobilenew3\node_modules\@nodert-win10-au\windows.ui.notifications 

            doesn't exist 

            [C:\Users\Jaco-Louis\WebstormProjects\moodlemobilenew3\node_modules\@nodert-win10-au\windows.ui.notifications]

            [C:\Users\Jaco-Louis\WebstormProjects\moodlemobilenew3\node_modules\@nodert-win10-au\windows.ui.notifications.ts]

            [C:\Users\Jaco-Louis\WebstormProjects\moodlemobilenew3\node_modules\@nodert-win10-au\windows.ui.notifications.js]

            [C:\Users\Jaco-Louis\WebstormProjects\moodlemobilenew3\node_modules\@nodert-win10-au\windows.ui.notifications.json]

            [C:\Users\Jaco-Louis\WebstormProjects\moodlemobilenew3\node_modules\@nodert-win10-au\windows.ui.notifications]

            @ ./node_modules/electron-windows-notifications/src/toast-notification.js 2:22-74 @ 

            ./node_modules/electron-windows-notifications/src/index.js @ 

            ./src/core/emulator/providers/local-notifications.ts @ ./src/core/emulator/emulator.module.ts @ 

            ./src/app/app.module.ts @ 

            ./src/app/main.ts,./node_modules/electron-windows-notifications/src/tile-notification.js Module not found: 

            Error: Can't resolve '@nodert-win10-au/windows.ui.notifications' in 

            'C:\Users\Jaco-Louis\WebstormProjects\moodlemobilenew3\node_modules\electron-windows-notifications\src' 

            resolve '@nodert-win10-au/windows.ui.notifications' in 

            'C:\Users\Jaco-Louis\WebstormProjects\moodlemobilenew3\node_modules\electron-windows-notifications\src' 

            Parsed request is a module using description file: 

            C:\Users\Jaco-Louis\WebstormProjects\moodlemobilenew3\node_modules\electron-windows-notifications\package.json

            (relative path: ./src) Field 'browser' doesn't contain a valid alias configuration after using description 

            file: 

            C:\Users\Jaco-Louis\WebstormProjects\moodlemobilenew3\node_modules\electron-windows-notifications\package.json

            (relative path: ./src) resolve as module looking for modules in 

            C:\Users\Jaco-Louis\WebstormProjects\moodlemobilenew3\node_modules using description file: 

            C:\Users\Jaco-Louis\WebstormProjects\moodlemobilenew3\package.json (relative path: ./node_modules) after 

            using description file: C:\Users\Jaco-Louis\WebstormProjects\moodlemobilenew3\package.json (relative path: 

            ./node_modules) using description file: C:\Users\Jaco-Louis\WebstormProjects\moodlemobilenew3\package.json 

            (relative path: ./node_modules/@nodert-win10-au/windows.ui.notifications) no extension 

            C:\Users\Jaco-Louis\WebstormProjects\moodlemobilenew3\node_modules\@nodert-win10-au\windows.ui.notifications 

            doesn't exist .ts 

            C:\Users\Jaco-Louis\WebstormProjects\moodlemobilenew3\node_modules\@nodert-win10-au\windows.ui.notifications.ts

            doesn't exist .js 

            C:\Users\Jaco-Louis\WebstormProjects\moodlemobilenew3\node_modules\@nodert-win10-au\windows.ui.notifications.js

            doesn't exist .json 

            C:\Users\Jaco-Louis\WebstormProjects\moodlemobilenew3\node_modules\@nodert-win10-au\windows.ui.notifications.json

            doesn't exist as directory 

            C:\Users\Jaco-Louis\WebstormProjects\moodlemobilenew3\node_modules\@nodert-win10-au\windows.ui.notifications 

            doesn't exist 

            [C:\Users\Jaco-Louis\WebstormProjects\moodlemobilenew3\node_modules\@nodert-win10-au\windows.ui.notifications]

            [C:\Users\Jaco-Louis\WebstormProjects\moodlemobilenew3\node_modules\@nodert-win10-au\windows.ui.notifications.ts]

            [C:\Users\Jaco-Louis\WebstormProjects\moodlemobilenew3\node_modules\@nodert-win10-au\windows.ui.notifications.js]

            [C:\Users\Jaco-Louis\WebstormProjects\moodlemobilenew3\node_modules\@nodert-win10-au\windows.ui.notifications.json]

            [C:\Users\Jaco-Louis\WebstormProjects\moodlemobilenew3\node_modules\@nodert-win10-au\windows.ui.notifications]

            @ ./node_modules/electron-windows-notifications/src/tile-notification.js 2:22-74 @ 

            ./node_modules/electron-windows-notifications/src/index.js @ 

            ./src/core/emulator/providers/local-notifications.ts @ ./src/core/emulator/emulator.module.ts @ 

            ./src/app/app.module.ts @ 

            ./src/app/main.ts,./node_modules/electron-windows-notifications/src/get-toast-notifier.js Module not found: 

            Error: Can't resolve '@nodert-win10-au/windows.ui.notifications' in 

            'C:\Users\Jaco-Louis\WebstormProjects\moodlemobilenew3\node_modules\electron-windows-notifications\src' 

            resolve '@nodert-win10-au/windows.ui.notifications' in 

            'C:\Users\Jaco-Louis\WebstormProjects\moodlemobilenew3\node_modules\electron-windows-notifications\src' 

            Parsed request is a module using description file: 

            C:\Users\Jaco-Louis\WebstormProjects\moodlemobilenew3\node_modules\electron-windows-notifications\package.json

            (relative path: ./src) Field 'browser' doesn't contain a valid alias configuration after using description 

            file: 

            C:\Users\Jaco-Louis\WebstormProjects\moodlemobilenew3\node_modules\electron-windows-notifications\package.json

            (relative path: ./src) resolve as module looking for modules in 

            C:\Users\Jaco-Louis\WebstormProjects\moodlemobilenew3\node_modules using description file: 

            C:\Users\Jaco-Louis\WebstormProjects\moodlemobilenew3\package.json (relative path: ./node_modules) after 

            using description file: C:\Users\Jaco-Louis\WebstormProjects\moodlemobilenew3\package.json (relative path: 

            ./node_modules) using description file: C:\Users\Jaco-Louis\WebstormProjects\moodlemobilenew3\package.json 

            (relative path: ./node_modules/@nodert-win10-au/windows.ui.notifications) no extension 

            C:\Users\Jaco-Louis\WebstormProjects\moodlemobilenew3\node_modules\@nodert-win10-au\windows.ui.notifications 

            doesn't exist .ts 

            C:\Users\Jaco-Louis\WebstormProjects\moodlemobilenew3\node_modules\@nodert-win10-au\windows.ui.notifications.ts

            doesn't exist .js 

            C:\Users\Jaco-Louis\WebstormProjects\moodlemobilenew3\node_modules\@nodert-win10-au\windows.ui.notifications.js

            doesn't exist .json 

            C:\Users\Jaco-Louis\WebstormProjects\moodlemobilenew3\node_modules\@nodert-win10-au\windows.ui.notifications.json

            doesn't exist as directory 

            C:\Users\Jaco-Louis\WebstormProjects\moodlemobilenew3\node_modules\@nodert-win10-au\windows.ui.notifications 

            doesn't exist 

            [C:\Users\Jaco-Louis\WebstormProjects\moodlemobilenew3\node_modules\@nodert-win10-au\windows.ui.notifications]

            [C:\Users\Jaco-Louis\WebstormProjects\moodlemobilenew3\node_modules\@nodert-win10-au\windows.ui.notifications.ts]

            [C:\Users\Jaco-Louis\WebstormProjects\moodlemobilenew3\node_modules\@nodert-win10-au\windows.ui.notifications.js]

            [C:\Users\Jaco-Louis\WebstormProjects\moodlemobilenew3\node_modules\@nodert-win10-au\windows.ui.notifications.json]

            [C:\Users\Jaco-Louis\WebstormProjects\moodlemobilenew3\node_modules\@nodert-win10-au\windows.ui.notifications]

            @ ./node_modules/electron-windows-notifications/src/get-toast-notifier.js 1:22-74 @ 

            ./node_modules/electron-windows-notifications/src/index.js @ 

            ./src/core/emulator/providers/local-notifications.ts @ ./src/core/emulator/emulator.module.ts @ 

            ./src/app/app.module.ts @ ./src/app/main.ts,./node_modules/electron-windows-notifications/src/history.js 

            Module not found: Error: Can't resolve '@nodert-win10-au/windows.ui.notifications' in 

            'C:\Users\Jaco-Louis\WebstormProjects\moodlemobilenew3\node_modules\electron-windows-notifications\src' 

            resolve '@nodert-win10-au/windows.ui.notifications' in 

            'C:\Users\Jaco-Louis\WebstormProjects\moodlemobilenew3\node_modules\electron-windows-notifications\src' 

            Parsed request is a module using description file: 

            C:\Users\Jaco-Louis\WebstormProjects\moodlemobilenew3\node_modules\electron-windows-notifications\package.json

            (relative path: ./src) Field 'browser' doesn't contain a valid alias configuration after using description 

            file: 

            C:\Users\Jaco-Louis\WebstormProjects\moodlemobilenew3\node_modules\electron-windows-notifications\package.json

            (relative path: ./src) resolve as module looking for modules in 

            C:\Users\Jaco-Louis\WebstormProjects\moodlemobilenew3\node_modules using description file: 

            C:\Users\Jaco-Louis\WebstormProjects\moodlemobilenew3\package.json (relative path: ./node_modules) after 

            using description file: C:\Users\Jaco-Louis\WebstormProjects\moodlemobilenew3\package.json (relative path: 

            ./node_modules) using description file: C:\Users\Jaco-Louis\WebstormProjects\moodlemobilenew3\package.json 

            (relative path: ./node_modules/@nodert-win10-au/windows.ui.notifications) no extension 

            C:\Users\Jaco-Louis\WebstormProjects\moodlemobilenew3\node_modules\@nodert-win10-au\windows.ui.notifications 

            doesn't exist .ts 

            C:\Users\Jaco-Louis\WebstormProjects\moodlemobilenew3\node_modules\@nodert-win10-au\windows.ui.notifications.ts

            doesn't exist .js 

            C:\Users\Jaco-Louis\WebstormProjects\moodlemobilenew3\node_modules\@nodert-win10-au\windows.ui.notifications.js

            doesn't exist .json 

            C:\Users\Jaco-Louis\WebstormProjects\moodlemobilenew3\node_modules\@nodert-win10-au\windows.ui.notifications.json

            doesn't exist as directory 

            C:\Users\Jaco-Louis\WebstormProjects\moodlemobilenew3\node_modules\@nodert-win10-au\windows.ui.notifications 

            doesn't exist 

            [C:\Users\Jaco-Louis\WebstormProjects\moodlemobilenew3\node_modules\@nodert-win10-au\windows.ui.notifications]

            [C:\Users\Jaco-Louis\WebstormProjects\moodlemobilenew3\node_modules\@nodert-win10-au\windows.ui.notifications.ts]

            [C:\Users\Jaco-Louis\WebstormProjects\moodlemobilenew3\node_modules\@nodert-win10-au\windows.ui.notifications.js]

            [C:\Users\Jaco-Louis\WebstormProjects\moodlemobilenew3\node_modules\@nodert-win10-au\windows.ui.notifications.json]

            [C:\Users\Jaco-Louis\WebstormProjects\moodlemobilenew3\node_modules\@nodert-win10-au\windows.ui.notifications]

            @ ./node_modules/electron-windows-notifications/src/history.js 1:22-74 @ 

            ./node_modules/electron-windows-notifications/src/index.js @ 

            ./src/core/emulator/providers/local-notifications.ts @ ./src/core/emulator/emulator.module.ts @ 

            ./src/app/app.module.ts @ 

            ./src/app/main.ts,./node_modules/electron-windows-notifications/src/tile-updater.js Module not found: Error: 

            Can't resolve '@nodert-win10-au/windows.ui.notifications' in 

            'C:\Users\Jaco-Louis\WebstormProjects\moodlemobilenew3\node_modules\electron-windows-notifications\src' 

            resolve '@nodert-win10-au/windows.ui.notifications' in 

            'C:\Users\Jaco-Louis\WebstormProjects\moodlemobilenew3\node_modules\electron-windows-notifications\src' 

            Parsed request is a module using description file: 

            C:\Users\Jaco-Louis\WebstormProjects\moodlemobilenew3\node_modules\electron-windows-notifications\package.json

            (relative path: ./src) Field 'browser' doesn't contain a valid alias configuration after using description 

            file: 

            C:\Users\Jaco-Louis\WebstormProjects\moodlemobilenew3\node_modules\electron-windows-notifications\package.json

            (relative path: ./src) resolve as module looking for modules in 

            C:\Users\Jaco-Louis\WebstormProjects\moodlemobilenew3\node_modules using description file: 

            C:\Users\Jaco-Louis\WebstormProjects\moodlemobilenew3\package.json (relative path: ./node_modules) after 

            using description file: C:\Users\Jaco-Louis\WebstormProjects\moodlemobilenew3\package.json (relative path: 

            ./node_modules) using description file: C:\Users\Jaco-Louis\WebstormProjects\moodlemobilenew3\package.json 

            (relative path: ./node_modules/@nodert-win10-au/windows.ui.notifications) no extension 

            C:\Users\Jaco-Louis\WebstormProjects\moodlemobilenew3\node_modules\@nodert-win10-au\windows.ui.notifications 

            doesn't exist .ts 

            C:\Users\Jaco-Louis\WebstormProjects\moodlemobilenew3\node_modules\@nodert-win10-au\windows.ui.notifications.ts

            doesn't exist .js 

            C:\Users\Jaco-Louis\WebstormProjects\moodlemobilenew3\node_modules\@nodert-win10-au\windows.ui.notifications.js

            doesn't exist .json 

            C:\Users\Jaco-Louis\WebstormProjects\moodlemobilenew3\node_modules\@nodert-win10-au\windows.ui.notifications.json

            doesn't exist as directory 

            C:\Users\Jaco-Louis\WebstormProjects\moodlemobilenew3\node_modules\@nodert-win10-au\windows.ui.notifications 

            doesn't exist 

            [C:\Users\Jaco-Louis\WebstormProjects\moodlemobilenew3\node_modules\@nodert-win10-au\windows.ui.notifications]

            [C:\Users\Jaco-Louis\WebstormProjects\moodlemobilenew3\node_modules\@nodert-win10-au\windows.ui.notifications.ts]

            [C:\Users\Jaco-Louis\WebstormProjects\moodlemobilenew3\node_modules\@nodert-win10-au\windows.ui.notifications.js]

            [C:\Users\Jaco-Louis\WebstormProjects\moodlemobilenew3\node_modules\@nodert-win10-au\windows.ui.notifications.json]

            [C:\Users\Jaco-Louis\WebstormProjects\moodlemobilenew3\node_modules\@nodert-win10-au\windows.ui.notifications]

            @ ./node_modules/electron-windows-notifications/src/tile-updater.js 1:22-74 @ 

            ./node_modules/electron-windows-notifications/src/index.js @ 

            ./src/core/emulator/providers/local-notifications.ts @ ./src/core/emulator/emulator.module.ts @ 

            ./src/app/app.module.ts @ 

            ./src/app/main.ts,./node_modules/electron-windows-notifications/src/secondary-tile.js Module not found: 

            Error: Can't resolve '@nodert-win10-au/windows.ui.startscreen' in 

            'C:\Users\Jaco-Louis\WebstormProjects\moodlemobilenew3\node_modules\electron-windows-notifications\src' 

            resolve '@nodert-win10-au/windows.ui.startscreen' in 

            'C:\Users\Jaco-Louis\WebstormProjects\moodlemobilenew3\node_modules\electron-windows-notifications\src' 

            Parsed request is a module using description file: 

            C:\Users\Jaco-Louis\WebstormProjects\moodlemobilenew3\node_modules\electron-windows-notifications\package.json

            (relative path: ./src) Field 'browser' doesn't contain a valid alias configuration after using description 

            file: 

            C:\Users\Jaco-Louis\WebstormProjects\moodlemobilenew3\node_modules\electron-windows-notifications\package.json

            (relative path: ./src) resolve as module looking for modules in 

            C:\Users\Jaco-Louis\WebstormProjects\moodlemobilenew3\node_modules using description file: 

            C:\Users\Jaco-Louis\WebstormProjects\moodlemobilenew3\package.json (relative path: ./node_modules) after 

            using description file: C:\Users\Jaco-Louis\WebstormProjects\moodlemobilenew3\package.json (relative path: 

            ./node_modules) using description file: C:\Users\Jaco-Louis\WebstormProjects\moodlemobilenew3\package.json 

            (relative path: ./node_modules/@nodert-win10-au/windows.ui.startscreen) no extension 

            C:\Users\Jaco-Louis\WebstormProjects\moodlemobilenew3\node_modules\@nodert-win10-au\windows.ui.startscreen 

            doesn't exist .ts 

            C:\Users\Jaco-Louis\WebstormProjects\moodlemobilenew3\node_modules\@nodert-win10-au\windows.ui.startscreen.ts

            doesn't exist .js 

            C:\Users\Jaco-Louis\WebstormProjects\moodlemobilenew3\node_modules\@nodert-win10-au\windows.ui.startscreen.js

            doesn't exist .json 

            C:\Users\Jaco-Louis\WebstormProjects\moodlemobilenew3\node_modules\@nodert-win10-au\windows.ui.startscreen.json

            doesn't exist as directory 

            C:\Users\Jaco-Louis\WebstormProjects\moodlemobilenew3\node_modules\@nodert-win10-au\windows.ui.startscreen 

            doesn't exist 

            [C:\Users\Jaco-Louis\WebstormProjects\moodlemobilenew3\node_modules\@nodert-win10-au\windows.ui.startscreen] 

            [C:\Users\Jaco-Louis\WebstormProjects\moodlemobilenew3\node_modules\@nodert-win10-au\windows.ui.startscreen.ts]

            [C:\Users\Jaco-Louis\WebstormProjects\moodlemobilenew3\node_modules\@nodert-win10-au\windows.ui.startscreen.js]

            [C:\Users\Jaco-Louis\WebstormProjects\moodlemobilenew3\node_modules\@nodert-win10-au\windows.ui.startscreen.json]

            [C:\Users\Jaco-Louis\WebstormProjects\moodlemobilenew3\node_modules\@nodert-win10-au\windows.ui.startscreen] 

            @ ./node_modules/electron-windows-notifications/src/secondary-tile.js 33:33-83 @ 

            ./node_modules/electron-windows-notifications/src/index.js @ 

            ./src/core/emulator/providers/local-notifications.ts @ ./src/core/emulator/emulator.module.ts @ 

            ./src/app/app.module.ts @ ./src/app/main.ts 

Error: ./node_modules/electron-windows-notifications/src/toast-notification.js

Module not found: Error: Can't resolve '@nodert-win10-au/windows.data.xml.dom' in 'C:\Users\Jaco-Louis\WebstormProjects\moodlemobilenew3\node_modules\electron-windows-notifications\src'

resolve '@nodert-win10-au/windows.data.xml.dom' in 'C:\Users\Jaco-Louis\WebstormProjects\moodlemobilenew3\node_modules\electron-windows-notifications\src'

  Parsed request is a module

  using description file: C:\Users\Jaco-Louis\WebstormProjects\moodlemobilenew3\node_modules\electron-windows-notifications\package.json (relative path: ./src)

    Field 'browser' doesn't contain a valid alias configuration

  after using description file: C:\Users\Jaco-Louis\WebstormProjects\moodlemobilenew3\node_modules\electron-windows-notifications\package.json (relative path: ./src)

    resolve as module

      looking for modules in C:\Users\Jaco-Louis\WebstormProjects\moodlemobilenew3\node_modules

        using description file: C:\Users\Jaco-Louis\WebstormProjects\moodlemobilenew3\package.json (relative path: ./node_modules)

        after using description file: C:\Users\Jaco-Louis\WebstormProjects\moodlemobilenew3\package.json (relative path: ./node_modules)

          using description file: C:\Users\Jaco-Louis\WebstormProjects\moodlemobilenew3\package.json (relative path: ./node_modules/@nodert-win10-au/windows.data.xml.dom)

            no extension

              C:\Users\Jaco-Louis\WebstormProjects\moodlemobilenew3\node_modules\@nodert-win10-au\windows.data.xml.dom doesn't exist

            .ts

              C:\Users\Jaco-Louis\WebstormProjects\moodlemobilenew3\node_modules\@nodert-win10-au\windows.data.xml.dom.ts doesn't exist

            .js

              C:\Users\Jaco-Louis\WebstormProjects\moodlemobilenew3\node_modules\@nodert-win10-au\windows.data.xml.dom.js doesn't exist

            .json

              C:\Users\Jaco-Louis\WebstormProjects\moodlemobilenew3\node_modules\@nodert-win10-au\windows.data.xml.dom.json doesn't exist

            as directory

              C:\Users\Jaco-Louis\WebstormProjects\moodlemobilenew3\node_modules\@nodert-win10-au\windows.data.xml.dom doesn't exist

[C:\Users\Jaco-Louis\WebstormProjects\moodlemobilenew3\node_modules\@nodert-win10-au\windows.data.xml.dom]

[C:\Users\Jaco-Louis\WebstormProjects\moodlemobilenew3\node_modules\@nodert-win10-au\windows.data.xml.dom.ts]

[C:\Users\Jaco-Louis\WebstormProjects\moodlemobilenew3\node_modules\@nodert-win10-au\windows.data.xml.dom.js]

[C:\Users\Jaco-Louis\WebstormProjects\moodlemobilenew3\node_modules\@nodert-win10-au\windows.data.xml.dom.json]

[C:\Users\Jaco-Louis\WebstormProjects\moodlemobilenew3\node_modules\@nodert-win10-au\windows.data.xml.dom]

 @ ./node_modules/electron-windows-notifications/src/toast-notification.js 1:12-60

 @ ./node_modules/electron-windows-notifications/src/index.js

 @ ./src/core/emulator/providers/local-notifications.ts

 @ ./src/core/emulator/emulator.module.ts

 @ ./src/app/app.module.ts

 @ ./src/app/main.ts,./node_modules/electron-windows-notifications/src/tile-notification.js

Module not found: Error: Can't resolve '@nodert-win10-au/windows.data.xml.dom' in 'C:\Users\Jaco-Louis\WebstormProjects\moodlemobilenew3\node_modules\electron-windows-notifications\src'

resolve '@nodert-win10-au/windows.data.xml.dom' in 'C:\Users\Jaco-Louis\WebstormProjects\moodlemobilenew3\node_modules\electron-windows-notifications\src'

  Parsed request is a module

  using description file: C:\Users\Jaco-Louis\WebstormProjects\moodlemobilenew3\node_modules\electron-windows-notifications\package.json (relative path: ./src)

    Field 'browser' doesn't contain a valid alias configuration

  after using description file: C:\Users\Jaco-Louis\WebstormProjects\moodlemobilenew3\node_modules\electron-windows-notifications\package.json (relative path: ./src)

    resolve as module

      looking for modules in C:\Users\Jaco-Louis\WebstormProjects\moodlemobilenew3\node_modules

        using description file: C:\Users\Jaco-Louis\WebstormProjects\moodlemobilenew3\package.json (relative path: ./node_modules)

        after using description file: C:\Users\Jaco-Louis\WebstormProjects\moodlemobilenew3\package.json (relative path: ./node_modules)

          using description file: C:\Users\Jaco-Louis\WebstormProjects\moodlemobilenew3\package.json (relative path: ./node_modules/@nodert-win10-au/windows.data.xml.dom)

            no extension

              C:\Users\Jaco-Louis\WebstormProjects\moodlemobilenew3\node_modules\@nodert-win10-au\windows.data.xml.dom doesn't exist

            .ts

              C:\Users\Jaco-Louis\WebstormProjects\moodlemobilenew3\node_modules\@nodert-win10-au\windows.data.xml.dom.ts doesn't exist

            .js

              C:\Users\Jaco-Louis\WebstormProjects\moodlemobilenew3\node_modules\@nodert-win10-au\windows.data.xml.dom.js doesn't exist

            .json

              C:\Users\Jaco-Louis\WebstormProjects\moodlemobilenew3\node_modules\@nodert-win10-au\windows.data.xml.dom.json doesn't exist

            as directory

              C:\Users\Jaco-Louis\WebstormProjects\moodlemobilenew3\node_modules\@nodert-win10-au\windows.data.xml.dom doesn't exist

[C:\Users\Jaco-Louis\WebstormProjects\moodlemobilenew3\node_modules\@nodert-win10-au\windows.data.xml.dom]

[C:\Users\Jaco-Louis\WebstormProjects\moodlemobilenew3\node_modules\@nodert-win10-au\windows.data.xml.dom.ts]

[C:\Users\Jaco-Louis\WebstormProjects\moodlemobilenew3\node_modules\@nodert-win10-au\windows.data.xml.dom.js]

[C:\Users\Jaco-Louis\WebstormProjects\moodlemobilenew3\node_modules\@nodert-win10-au\windows.data.xml.dom.json]

[C:\Users\Jaco-Louis\WebstormProjects\moodlemobilenew3\node_modules\@nodert-win10-au\windows.data.xml.dom]

 @ ./node_modules/electron-windows-notifications/src/tile-notification.js 1:12-60

 @ ./node_modules/electron-windows-notifications/src/index.js

 @ ./src/core/emulator/providers/local-notifications.ts

 @ ./src/core/emulator/emulator.module.ts

 @ ./src/app/app.module.ts

 @ ./src/app/main.ts,./node_modules/electron-windows-notifications/src/secondary-tile.js

Module not found: Error: Can't resolve '@nodert-win10-au/windows.foundation' in 'C:\Users\Jaco-Louis\WebstormProjects\moodlemobilenew3\node_modules\electron-windows-notifications\src'

resolve '@nodert-win10-au/windows.foundation' in 'C:\Users\Jaco-Louis\WebstormProjects\moodlemobilenew3\node_modules\electron-windows-notifications\src'

  Parsed request is a module

  using description file: C:\Users\Jaco-Louis\WebstormProjects\moodlemobilenew3\node_modules\electron-windows-notifications\package.json (relative path: ./src)

    Field 'browser' doesn't contain a valid alias configuration

  after using description file: C:\Users\Jaco-Louis\WebstormProjects\moodlemobilenew3\node_modules\electron-windows-notifications\package.json (relative path: ./src)

    resolve as module

      looking for modules in C:\Users\Jaco-Louis\WebstormProjects\moodlemobilenew3\node_modules

        using description file: C:\Users\Jaco-Louis\WebstormProjects\moodlemobilenew3\package.json (relative path: ./node_modules)

        after using description file: C:\Users\Jaco-Louis\WebstormProjects\moodlemobilenew3\package.json (relative path: ./node_modules)

          using description file: C:\Users\Jaco-Louis\WebstormProjects\moodlemobilenew3\package.json (relative path: ./node_modules/@nodert-win10-au/windows.foundation)

            no extension

              C:\Users\Jaco-Louis\WebstormProjects\moodlemobilenew3\node_modules\@nodert-win10-au\windows.foundation doesn't exist

            .ts

              C:\Users\Jaco-Louis\WebstormProjects\moodlemobilenew3\node_modules\@nodert-win10-au\windows.foundation.ts doesn't exist

            .js

              C:\Users\Jaco-Louis\WebstormProjects\moodlemobilenew3\node_modules\@nodert-win10-au\windows.foundation.js doesn't exist

            .json

              C:\Users\Jaco-Louis\WebstormProjects\moodlemobilenew3\node_modules\@nodert-win10-au\windows.foundation.json doesn't exist

            as directory

              C:\Users\Jaco-Louis\WebstormProjects\moodlemobilenew3\node_modules\@nodert-win10-au\windows.foundation doesn't exist

[C:\Users\Jaco-Louis\WebstormProjects\moodlemobilenew3\node_modules\@nodert-win10-au\windows.foundation]

[C:\Users\Jaco-Louis\WebstormProjects\moodlemobilenew3\node_modules\@nodert-win10-au\windows.foundation.ts]

[C:\Users\Jaco-Louis\WebstormProjects\moodlemobilenew3\node_modules\@nodert-win10-au\windows.foundation.js]

[C:\Users\Jaco-Louis\WebstormProjects\moodlemobilenew3\node_modules\@nodert-win10-au\windows.foundation.json]

[C:\Users\Jaco-Louis\WebstormProjects\moodlemobilenew3\node_modules\@nodert-win10-au\windows.foundation]

 @ ./node_modules/electron-windows-notifications/src/secondary-tile.js 34:31-77

 @ ./node_modules/electron-windows-notifications/src/index.js

 @ ./src/core/emulator/providers/local-notifications.ts

 @ ./src/core/emulator/emulator.module.ts

 @ ./src/app/app.module.ts

 @ ./src/app/main.ts,./node_modules/electron-windows-notifications/src/index.js

Module not found: Error: Can't resolve '@nodert-win10-au/windows.ui.notifications' in 'C:\Users\Jaco-Louis\WebstormProjects\moodlemobilenew3\node_modules\electron-windows-notifications\src

'

resolve '@nodert-win10-au/windows.ui.notifications' in 'C:\Users\Jaco-Louis\WebstormProjects\moodlemobilenew3\node_modules\electron-windows-notifications\src'

  Parsed request is a module

  using description file: C:\Users\Jaco-Louis\WebstormProjects\moodlemobilenew3\node_modules\electron-windows-notifications\package.json (relative path: ./src)

    Field 'browser' doesn't contain a valid alias configuration

  after using description file: C:\Users\Jaco-Louis\WebstormProjects\moodlemobilenew3\node_modules\electron-windows-notifications\package.json (relative path: ./src)

    resolve as module

      looking for modules in C:\Users\Jaco-Louis\WebstormProjects\moodlemobilenew3\node_modules

        using description file: C:\Users\Jaco-Louis\WebstormProjects\moodlemobilenew3\package.json (relative path: ./node_modules)

        after using description file: C:\Users\Jaco-Louis\WebstormProjects\moodlemobilenew3\package.json (relative path: ./node_modules)

          using description file: C:\Users\Jaco-Louis\WebstormProjects\moodlemobilenew3\package.json (relative path: ./node_modules/@nodert-win10-au/windows.ui.notifications)

            no extension

              C:\Users\Jaco-Louis\WebstormProjects\moodlemobilenew3\node_modules\@nodert-win10-au\windows.ui.notifications doesn't exist

            .ts

              C:\Users\Jaco-Louis\WebstormProjects\moodlemobilenew3\node_modules\@nodert-win10-au\windows.ui.notifications.ts doesn't exist

            .js

              C:\Users\Jaco-Louis\WebstormProjects\moodlemobilenew3\node_modules\@nodert-win10-au\windows.ui.notifications.js doesn't exist

            .json

              C:\Users\Jaco-Louis\WebstormProjects\moodlemobilenew3\node_modules\@nodert-win10-au\windows.ui.notifications.json doesn't exist

            as directory

              C:\Users\Jaco-Louis\WebstormProjects\moodlemobilenew3\node_modules\@nodert-win10-au\windows.ui.notifications doesn't exist

[C:\Users\Jaco-Louis\WebstormProjects\moodlemobilenew3\node_modules\@nodert-win10-au\windows.ui.notifications]

[C:\Users\Jaco-Louis\WebstormProjects\moodlemobilenew3\node_modules\@nodert-win10-au\windows.ui.notifications.ts]

[C:\Users\Jaco-Louis\WebstormProjects\moodlemobilenew3\node_modules\@nodert-win10-au\windows.ui.notifications.js]

[C:\Users\Jaco-Louis\WebstormProjects\moodlemobilenew3\node_modules\@nodert-win10-au\windows.ui.notifications.json]

[C:\Users\Jaco-Louis\WebstormProjects\moodlemobilenew3\node_modules\@nodert-win10-au\windows.ui.notifications]

 @ ./node_modules/electron-windows-notifications/src/index.js 33:26-78

 @ ./src/core/emulator/providers/local-notifications.ts

 @ ./src/core/emulator/emulator.module.ts

 @ ./src/app/app.module.ts

 @ ./src/app/main.ts,./node_modules/electron-windows-notifications/src/toast-notification.js

Module not found: Error: Can't resolve '@nodert-win10-au/windows.ui.notifications' in 'C:\Users\Jaco-Louis\WebstormProjects\moodlemobilenew3\node_modules\electron-windows-notifications\src

'

resolve '@nodert-win10-au/windows.ui.notifications' in 'C:\Users\Jaco-Louis\WebstormProjects\moodlemobilenew3\node_modules\electron-windows-notifications\src'

  Parsed request is a module

  using description file: C:\Users\Jaco-Louis\WebstormProjects\moodlemobilenew3\node_modules\electron-windows-notifications\package.json (relative path: ./src)

    Field 'browser' doesn't contain a valid alias configuration

  after using description file: C:\Users\Jaco-Louis\WebstormProjects\moodlemobilenew3\node_modules\electron-windows-notifications\package.json (relative path: ./src)

    resolve as module

      looking for modules in C:\Users\Jaco-Louis\WebstormProjects\moodlemobilenew3\node_modules

        using description file: C:\Users\Jaco-Louis\WebstormProjects\moodlemobilenew3\package.json (relative path: ./node_modules)

        after using description file: C:\Users\Jaco-Louis\WebstormProjects\moodlemobilenew3\package.json (relative path: ./node_modules)

          using description file: C:\Users\Jaco-Louis\WebstormProjects\moodlemobilenew3\package.json (relative path: ./node_modules/@nodert-win10-au/windows.ui.notifications)

            no extension

              C:\Users\Jaco-Louis\WebstormProjects\moodlemobilenew3\node_modules\@nodert-win10-au\windows.ui.notifications doesn't exist

            .ts

              C:\Users\Jaco-Louis\WebstormProjects\moodlemobilenew3\node_modules\@nodert-win10-au\windows.ui.notifications.ts doesn't exist

            .js

              C:\Users\Jaco-Louis\WebstormProjects\moodlemobilenew3\node_modules\@nodert-win10-au\windows.ui.notifications.js doesn't exist

            .json

              C:\Users\Jaco-Louis\WebstormProjects\moodlemobilenew3\node_modules\@nodert-win10-au\windows.ui.notifications.json doesn't exist

            as directory

              C:\Users\Jaco-Louis\WebstormProjects\moodlemobilenew3\node_modules\@nodert-win10-au\windows.ui.notifications doesn't exist

[C:\Users\Jaco-Louis\WebstormProjects\moodlemobilenew3\node_modules\@nodert-win10-au\windows.ui.notifications]

[C:\Users\Jaco-Louis\WebstormProjects\moodlemobilenew3\node_modules\@nodert-win10-au\windows.ui.notifications.ts]

[C:\Users\Jaco-Louis\WebstormProjects\moodlemobilenew3\node_modules\@nodert-win10-au\windows.ui.notifications.js]

[C:\Users\Jaco-Louis\WebstormProjects\moodlemobilenew3\node_modules\@nodert-win10-au\windows.ui.notifications.json]

[C:\Users\Jaco-Louis\WebstormProjects\moodlemobilenew3\node_modules\@nodert-win10-au\windows.ui.notifications]

 @ ./node_modules/electron-windows-notifications/src/toast-notification.js 2:22-74

 @ ./node_modules/electron-windows-notifications/src/index.js

 @ ./src/core/emulator/providers/local-notifications.ts

 @ ./src/core/emulator/emulator.module.ts

 @ ./src/app/app.module.ts

 @ ./src/app/main.ts,./node_modules/electron-windows-notifications/src/tile-notification.js

Module not found: Error: Can't resolve '@nodert-win10-au/windows.ui.notifications' in 'C:\Users\Jaco-Louis\WebstormProjects\moodlemobilenew3\node_modules\electron-windows-notifications\src

'

resolve '@nodert-win10-au/windows.ui.notifications' in 'C:\Users\Jaco-Louis\WebstormProjects\moodlemobilenew3\node_modules\electron-windows-notifications\src'

  Parsed request is a module

  using description file: C:\Users\Jaco-Louis\WebstormProjects\moodlemobilenew3\node_modules\electron-windows-notifications\package.json (relative path: ./src)

    Field 'browser' doesn't contain a valid alias configuration

  after using description file: C:\Users\Jaco-Louis\WebstormProjects\moodlemobilenew3\node_modules\electron-windows-notifications\package.json (relative path: ./src)

    resolve as module

      looking for modules in C:\Users\Jaco-Louis\WebstormProjects\moodlemobilenew3\node_modules

        using description file: C:\Users\Jaco-Louis\WebstormProjects\moodlemobilenew3\package.json (relative path: ./node_modules)

        after using description file: C:\Users\Jaco-Louis\WebstormProjects\moodlemobilenew3\package.json (relative path: ./node_modules)

          using description file: C:\Users\Jaco-Louis\WebstormProjects\moodlemobilenew3\package.json (relative path: ./node_modules/@nodert-win10-au/windows.ui.notifications)

            no extension

              C:\Users\Jaco-Louis\WebstormProjects\moodlemobilenew3\node_modules\@nodert-win10-au\windows.ui.notifications doesn't exist

            .ts

              C:\Users\Jaco-Louis\WebstormProjects\moodlemobilenew3\node_modules\@nodert-win10-au\windows.ui.notifications.ts doesn't exist

            .js

              C:\Users\Jaco-Louis\WebstormProjects\moodlemobilenew3\node_modules\@nodert-win10-au\windows.ui.notifications.js doesn't exist

            .json

              C:\Users\Jaco-Louis\WebstormProjects\moodlemobilenew3\node_modules\@nodert-win10-au\windows.ui.notifications.json doesn't exist

            as directory

              C:\Users\Jaco-Louis\WebstormProjects\moodlemobilenew3\node_modules\@nodert-win10-au\windows.ui.notifications doesn't exist

[C:\Users\Jaco-Louis\WebstormProjects\moodlemobilenew3\node_modules\@nodert-win10-au\windows.ui.notifications]

[C:\Users\Jaco-Louis\WebstormProjects\moodlemobilenew3\node_modules\@nodert-win10-au\windows.ui.notifications.ts]

[C:\Users\Jaco-Louis\WebstormProjects\moodlemobilenew3\node_modules\@nodert-win10-au\windows.ui.notifications.js]

[C:\Users\Jaco-Louis\WebstormProjects\moodlemobilenew3\node_modules\@nodert-win10-au\windows.ui.notifications.json]

[C:\Users\Jaco-Louis\WebstormProjects\moodlemobilenew3\node_modules\@nodert-win10-au\windows.ui.notifications]

 @ ./node_modules/electron-windows-notifications/src/tile-notification.js 2:22-74

 @ ./node_modules/electron-windows-notifications/src/index.js

 @ ./src/core/emulator/providers/local-notifications.ts

 @ ./src/core/emulator/emulator.module.ts

 @ ./src/app/app.module.ts

 @ ./src/app/main.ts,./node_modules/electron-windows-notifications/src/get-toast-notifier.js

Module not found: Error: Can't resolve '@nodert-win10-au/windows.ui.notifications' in 'C:\Users\Jaco-Louis\WebstormProjects\moodlemobilenew3\node_modules\electron-windows-notifications\src

'

resolve '@nodert-win10-au/windows.ui.notifications' in 'C:\Users\Jaco-Louis\WebstormProjects\moodlemobilenew3\node_modules\electron-windows-notifications\src'

  Parsed request is a module

  using description file: C:\Users\Jaco-Louis\WebstormProjects\moodlemobilenew3\node_modules\electron-windows-notifications\package.json (relative path: ./src)

    Field 'browser' doesn't contain a valid alias configuration

  after using description file: C:\Users\Jaco-Louis\WebstormProjects\moodlemobilenew3\node_modules\electron-windows-notifications\package.json (relative path: ./src)

    resolve as module

      looking for modules in C:\Users\Jaco-Louis\WebstormProjects\moodlemobilenew3\node_modules

        using description file: C:\Users\Jaco-Louis\WebstormProjects\moodlemobilenew3\package.json (relative path: ./node_modules)

        after using description file: C:\Users\Jaco-Louis\WebstormProjects\moodlemobilenew3\package.json (relative path: ./node_modules)

          using description file: C:\Users\Jaco-Louis\WebstormProjects\moodlemobilenew3\package.json (relative path: ./node_modules/@nodert-win10-au/windows.ui.notifications)

            no extension

              C:\Users\Jaco-Louis\WebstormProjects\moodlemobilenew3\node_modules\@nodert-win10-au\windows.ui.notifications doesn't exist

            .ts

              C:\Users\Jaco-Louis\WebstormProjects\moodlemobilenew3\node_modules\@nodert-win10-au\windows.ui.notifications.ts doesn't exist

            .js

              C:\Users\Jaco-Louis\WebstormProjects\moodlemobilenew3\node_modules\@nodert-win10-au\windows.ui.notifications.js doesn't exist

            .json

              C:\Users\Jaco-Louis\WebstormProjects\moodlemobilenew3\node_modules\@nodert-win10-au\windows.ui.notifications.json doesn't exist

            as directory

              C:\Users\Jaco-Louis\WebstormProjects\moodlemobilenew3\node_modules\@nodert-win10-au\windows.ui.notifications doesn't exist

[C:\Users\Jaco-Louis\WebstormProjects\moodlemobilenew3\node_modules\@nodert-win10-au\windows.ui.notifications]

[C:\Users\Jaco-Louis\WebstormProjects\moodlemobilenew3\node_modules\@nodert-win10-au\windows.ui.notifications.ts]

[C:\Users\Jaco-Louis\WebstormProjects\moodlemobilenew3\node_modules\@nodert-win10-au\windows.ui.notifications.js]

[C:\Users\Jaco-Louis\WebstormProjects\moodlemobilenew3\node_modules\@nodert-win10-au\windows.ui.notifications.json]

[C:\Users\Jaco-Louis\WebstormProjects\moodlemobilenew3\node_modules\@nodert-win10-au\windows.ui.notifications]

 @ ./node_modules/electron-windows-notifications/src/get-toast-notifier.js 1:22-74

 @ ./node_modules/electron-windows-notifications/src/index.js

 @ ./src/core/emulator/providers/local-notifications.ts

 @ ./src/core/emulator/emulator.module.ts

 @ ./src/app/app.module.ts

 @ ./src/app/main.ts,./node_modules/electron-windows-notifications/src/history.js

Module not found: Error: Can't resolve '@nodert-win10-au/windows.ui.notifications' in 'C:\Users\Jaco-Louis\WebstormProjects\moodlemobilenew3\node_modules\electron-windows-notifications\src

'

resolve '@nodert-win10-au/windows.ui.notifications' in 'C:\Users\Jaco-Louis\WebstormProjects\moodlemobilenew3\node_modules\electron-windows-notifications\src'

  Parsed request is a module

  using description file: C:\Users\Jaco-Louis\WebstormProjects\moodlemobilenew3\node_modules\electron-windows-notifications\package.json (relative path: ./src)

    Field 'browser' doesn't contain a valid alias configuration

  after using description file: C:\Users\Jaco-Louis\WebstormProjects\moodlemobilenew3\node_modules\electron-windows-notifications\package.json (relative path: ./src)

    resolve as module

      looking for modules in C:\Users\Jaco-Louis\WebstormProjects\moodlemobilenew3\node_modules

        using description file: C:\Users\Jaco-Louis\WebstormProjects\moodlemobilenew3\package.json (relative path: ./node_modules)

        after using description file: C:\Users\Jaco-Louis\WebstormProjects\moodlemobilenew3\package.json (relative path: ./node_modules)

          using description file: C:\Users\Jaco-Louis\WebstormProjects\moodlemobilenew3\package.json (relative path: ./node_modules/@nodert-win10-au/windows.ui.notifications)

            no extension

              C:\Users\Jaco-Louis\WebstormProjects\moodlemobilenew3\node_modules\@nodert-win10-au\windows.ui.notifications doesn't exist

            .ts

              C:\Users\Jaco-Louis\WebstormProjects\moodlemobilenew3\node_modules\@nodert-win10-au\windows.ui.notifications.ts doesn't exist

            .js

              C:\Users\Jaco-Louis\WebstormProjects\moodlemobilenew3\node_modules\@nodert-win10-au\windows.ui.notifications.js doesn't exist

            .json

              C:\Users\Jaco-Louis\WebstormProjects\moodlemobilenew3\node_modules\@nodert-win10-au\windows.ui.notifications.json doesn't exist

            as directory

              C:\Users\Jaco-Louis\WebstormProjects\moodlemobilenew3\node_modules\@nodert-win10-au\windows.ui.notifications doesn't exist

[C:\Users\Jaco-Louis\WebstormProjects\moodlemobilenew3\node_modules\@nodert-win10-au\windows.ui.notifications]

[C:\Users\Jaco-Louis\WebstormProjects\moodlemobilenew3\node_modules\@nodert-win10-au\windows.ui.notifications.ts]

[C:\Users\Jaco-Louis\WebstormProjects\moodlemobilenew3\node_modules\@nodert-win10-au\windows.ui.notifications.js]

[C:\Users\Jaco-Louis\WebstormProjects\moodlemobilenew3\node_modules\@nodert-win10-au\windows.ui.notifications.json]

[C:\Users\Jaco-Louis\WebstormProjects\moodlemobilenew3\node_modules\@nodert-win10-au\windows.ui.notifications]

 @ ./node_modules/electron-windows-notifications/src/history.js 1:22-74

 @ ./node_modules/electron-windows-notifications/src/index.js

 @ ./src/core/emulator/providers/local-notifications.ts

 @ ./src/core/emulator/emulator.module.ts

 @ ./src/app/app.module.ts

 @ ./src/app/main.ts,./node_modules/electron-windows-notifications/src/tile-updater.js

Module not found: Error: Can't resolve '@nodert-win10-au/windows.ui.notifications' in 'C:\Users\Jaco-Louis\WebstormProjects\moodlemobilenew3\node_modules\electron-windows-notifications\src

'

resolve '@nodert-win10-au/windows.ui.notifications' in 'C:\Users\Jaco-Louis\WebstormProjects\moodlemobilenew3\node_modules\electron-windows-notifications\src'

  Parsed request is a module

  using description file: C:\Users\Jaco-Louis\WebstormProjects\moodlemobilenew3\node_modules\electron-windows-notifications\package.json (relative path: ./src)

    Field 'browser' doesn't contain a valid alias configuration

  after using description file: C:\Users\Jaco-Louis\WebstormProjects\moodlemobilenew3\node_modules\electron-windows-notifications\package.json (relative path: ./src)

    resolve as module

      looking for modules in C:\Users\Jaco-Louis\WebstormProjects\moodlemobilenew3\node_modules

        using description file: C:\Users\Jaco-Louis\WebstormProjects\moodlemobilenew3\package.json (relative path: ./node_modules)

        after using description file: C:\Users\Jaco-Louis\WebstormProjects\moodlemobilenew3\package.json (relative path: ./node_modules)

          using description file: C:\Users\Jaco-Louis\WebstormProjects\moodlemobilenew3\package.json (relative path: ./node_modules/@nodert-win10-au/windows.ui.notifications)

            no extension

              C:\Users\Jaco-Louis\WebstormProjects\moodlemobilenew3\node_modules\@nodert-win10-au\windows.ui.notifications doesn't exist

            .ts

              C:\Users\Jaco-Louis\WebstormProjects\moodlemobilenew3\node_modules\@nodert-win10-au\windows.ui.notifications.ts doesn't exist

            .js

              C:\Users\Jaco-Louis\WebstormProjects\moodlemobilenew3\node_modules\@nodert-win10-au\windows.ui.notifications.js doesn't exist

            .json

              C:\Users\Jaco-Louis\WebstormProjects\moodlemobilenew3\node_modules\@nodert-win10-au\windows.ui.notifications.json doesn't exist

            as directory

              C:\Users\Jaco-Louis\WebstormProjects\moodlemobilenew3\node_modules\@nodert-win10-au\windows.ui.notifications doesn't exist

[C:\Users\Jaco-Louis\WebstormProjects\moodlemobilenew3\node_modules\@nodert-win10-au\windows.ui.notifications]

[C:\Users\Jaco-Louis\WebstormProjects\moodlemobilenew3\node_modules\@nodert-win10-au\windows.ui.notifications.ts]

[C:\Users\Jaco-Louis\WebstormProjects\moodlemobilenew3\node_modules\@nodert-win10-au\windows.ui.notifications.js]

[C:\Users\Jaco-Louis\WebstormProjects\moodlemobilenew3\node_modules\@nodert-win10-au\windows.ui.notifications.json]

[C:\Users\Jaco-Louis\WebstormProjects\moodlemobilenew3\node_modules\@nodert-win10-au\windows.ui.notifications]

 @ ./node_modules/electron-windows-notifications/src/tile-updater.js 1:22-74

 @ ./node_modules/electron-windows-notifications/src/index.js

 @ ./src/core/emulator/providers/local-notifications.ts

 @ ./src/core/emulator/emulator.module.ts

 @ ./src/app/app.module.ts

 @ ./src/app/main.ts,./node_modules/electron-windows-notifications/src/secondary-tile.js

Module not found: Error: Can't resolve '@nodert-win10-au/windows.ui.startscreen' in 'C:\Users\Jaco-Louis\WebstormProjects\moodlemobilenew3\node_modules\electron-windows-notifications\src'

resolve '@nodert-win10-au/windows.ui.startscreen' in 'C:\Users\Jaco-Louis\WebstormProjects\moodlemobilenew3\node_modules\electron-windows-notifications\src'

  Parsed request is a module

  using description file: C:\Users\Jaco-Louis\WebstormProjects\moodlemobilenew3\node_modules\electron-windows-notifications\package.json (relative path: ./src)

    Field 'browser' doesn't contain a valid alias configuration

  after using description file: C:\Users\Jaco-Louis\WebstormProjects\moodlemobilenew3\node_modules\electron-windows-notifications\package.json (relative path: ./src)

    resolve as module

      looking for modules in C:\Users\Jaco-Louis\WebstormProjects\moodlemobilenew3\node_modules

        using description file: C:\Users\Jaco-Louis\WebstormProjects\moodlemobilenew3\package.json (relative path: ./node_modules)

        after using description file: C:\Users\Jaco-Louis\WebstormProjects\moodlemobilenew3\package.json (relative path: ./node_modules)

          using description file: C:\Users\Jaco-Louis\WebstormProjects\moodlemobilenew3\package.json (relative path: ./node_modules/@nodert-win10-au/windows.ui.startscreen)

            no extension

              C:\Users\Jaco-Louis\WebstormProjects\moodlemobilenew3\node_modules\@nodert-win10-au\windows.ui.startscreen doesn't exist

            .ts

              C:\Users\Jaco-Louis\WebstormProjects\moodlemobilenew3\node_modules\@nodert-win10-au\windows.ui.startscreen.ts doesn't exist

            .js

              C:\Users\Jaco-Louis\WebstormProjects\moodlemobilenew3\node_modules\@nodert-win10-au\windows.ui.startscreen.js doesn't exist

            .json

              C:\Users\Jaco-Louis\WebstormProjects\moodlemobilenew3\node_modules\@nodert-win10-au\windows.ui.startscreen.json doesn't exist

            as directory

              C:\Users\Jaco-Louis\WebstormProjects\moodlemobilenew3\node_modules\@nodert-win10-au\windows.ui.startscreen doesn't exist

[C:\Users\Jaco-Louis\WebstormProjects\moodlemobilenew3\node_modules\@nodert-win10-au\windows.ui.startscreen]

[C:\Users\Jaco-Louis\WebstormProjects\moodlemobilenew3\node_modules\@nodert-win10-au\windows.ui.startscreen.ts]

[C:\Users\Jaco-Louis\WebstormProjects\moodlemobilenew3\node_modules\@nodert-win10-au\windows.ui.startscreen.js]

[C:\Users\Jaco-Louis\WebstormProjects\moodlemobilenew3\node_modules\@nodert-win10-au\windows.ui.startscreen.json]

[C:\Users\Jaco-Louis\WebstormProjects\moodlemobilenew3\node_modules\@nodert-win10-au\windows.ui.startscreen]

 @ ./node_modules/electron-windows-notifications/src/secondary-tile.js 33:33-83

 @ ./node_modules/electron-windows-notifications/src/index.js

 @ ./src/core/emulator/providers/local-notifications.ts

 @ ./src/core/emulator/emulator.module.ts

 @ ./src/app/app.module.ts

 @ ./src/app/main.ts

    at new BuildError (C:\Users\Jaco-Louis\WebstormProjects\moodlemobilenew3\node_modules\@ionic\app-scripts\dist\util\errors.js:16:28)

    at callback (C:\Users\Jaco-Louis\WebstormProjects\moodlemobilenew3\node_modules\@ionic\app-scripts\dist\webpack.js:121:28)

    at emitRecords.err (C:\Users\Jaco-Louis\WebstormProjects\moodlemobilenew3\node_modules\webpack\lib\Compiler.js:269:13)

    at Compiler.emitRecords (C:\Users\Jaco-Louis\WebstormProjects\moodlemobilenew3\node_modules\webpack\lib\Compiler.js:375:38)

    at emitAssets.err (C:\Users\Jaco-Louis\WebstormProjects\moodlemobilenew3\node_modules\webpack\lib\Compiler.js:262:10)

    at applyPluginsAsyncSeries1.err (C:\Users\Jaco-Louis\WebstormProjects\moodlemobilenew3\node_modules\webpack\lib\Compiler.js:368:12)

    at next (C:\Users\Jaco-Louis\WebstormProjects\moodlemobilenew3\node_modules\tapable\lib\Tapable.js:218:11)

    at Compiler.compiler.plugin (C:\Users\Jaco-Louis\WebstormProjects\moodlemobilenew3\node_modules\webpack\lib\performance\SizeLimitsPlugin.js:99:4)

    at Compiler.applyPluginsAsyncSeries1 (C:\Users\Jaco-Louis\WebstormProjects\moodlemobilenew3\node_modules\tapable\lib\Tapable.js:222:13)

    at Compiler.afterEmit (C:\Users\Jaco-Louis\WebstormProjects\moodlemobilenew3\node_modules\webpack\lib\Compiler.js:365:9)

npm ERR! code ELIFECYCLE

npm ERR! errno 1

npm ERR! moodlemobile@3.5.1 ionic:build: `node --max-old-space-size=16384 ./node_modules/@ionic/app-scripts/bin/ionic-app-scripts.js build`

npm ERR! Exit status 1

npm ERR!

npm ERR! Failed at the moodlemobile@3.5.1 ionic:build script.

npm ERR! This is probably not a problem with npm. There is likely additional logging output above.


npm ERR! A complete log of this run can be found in:

npm ERR!     C:\Users\Jaco-Louis\AppData\Roaming\npm-cache\_logs\2018-11-21T11_32_31_320Z-debug.log

[ERROR] An error occurred while running subprocess npm.


        npm run ionic:build exited with exit code 1.


        Re-running this command with the --verbose flag may provide more information.


I have also tried building the app using android studio, which produces the following error message:

AAPT2 error: check logs for details

I have added the following to the gradle-wrapper.properties, but still no luck:

android.enableAapt2=false

Any help would be much appreciated as I was able to develop a custom Moodle mobile app for Moodle mobile app 2 but I am now unable to update the app due to not being able to set up the development environmen.

Kind regards
Jaco-Louis


 
Average of ratings: -
Picture of Mark Johnson
Re: Unable to set up development environment
Core developersParticularly helpful MoodlersPlugin developers

Hi Jaco,

If you've got a lot of terminal output to share, it's best to use a service like PrivateBin and share the URL in your post. Otherwise you create a very long page which makes it hard for people who might help you to navigate the thread.

 
Average of ratings: Useful (1)
Picture of Dani Palou
Re: Unable to set up development environment
Core developersMoodle HQParticularly helpful MoodlersPlugin developers

Hi Jaco,

please make sure that you have installed this plugin:

cordova-android-support-gradle-release

Please use the version 2.0.1 of that plugin, there were some changes in Android recently that break the build system.

Also, please make sure to use the version 7.1.2 for the Android platform.

So I recommend you to run:

cordova platform remove android

cordova plugin remove cordova-android-support-gradle-release

cordova platform add android@7.1.2

cordova plugin add cordova-android-support-gradle-release@2.0.1

Cheers,

Dani

 
Average of ratings: -